{"text_format":"3","workbook":"xlsx","n_sheets":2,"sheets":["女","男"],"not_rendered":{"external_links":2},"read":"whole","date_system":"1900"}

{"sheet":"女","index":0,"n_rows":83,"n_cols":8,"rows_kept":83,"merged":[[0,0,0,6]]}
["國立虎尾科技大學113學年度暑假住宿床位公告"]
["寢室","床位","住宿起迄日","學號","姓名","性別","科系","日夜間部"]
[11101,1,"6/24-8/4",41239222,"劉O庭","女","工管系","日間部"]
[11101,2,"6/24-8-9",41245105,"吳O瑄","女","財金系","日間部"]
[11101,3,"6/24-8/3",11161116,"林O蒨","女","資管碩士","日間部"]
[11101,4,"6/24-8/3",11176142,"張O綾","女","光材碩士","日間部"]
[11102,1,"6/24-7/5",41132108,"楊O綺","女","材料系","日間部"]
[11102,2,"6/24-7/4",41224103,"賴O均","女","動機系","日間部"]
[11102,3,"6/24-7/8",51015120,"王O瑜","女","資工科","日間部"]
[11102,4,"6/24-7/3",41147117,"曾O嘉","女","生科系","日間部"]
[11103,1,"7/1-7/20",41231101,"林O廷","女","飛機械組","日間部"]
[11103,2,"7/7-7/20",41231104,"蔡O瑜","女","飛機械組","日間部"]
[11103,3,"6/24-8/23",41225603,"周O妤","女","電機系","進修推廣部"]
[11103,4,"6/24-8/23",41241116,"葉O君","女","資管系","日間部"]
[11104,1,"7/15-8/23",41171102,"范O語","女","機電輔系","日間部"]
[11104,2,"7/14-8/23",41146109,"杜O縵","女","企管系","日間部"]
[11104,3,"7/14-8/23",41045118,"郭O芹","女","財金系","日間部"]
[11104,4,"6/24-8/23",40947111,"高O君","女","生科系","日間部"]
[11105,1,"6/24-8/23",41248126,"鄒O竹","女","多媒體系","日間部"]
[11105,2,"6/24-8/23",41242208,"王O琪","女","應外系","日間部"]
[11105,3,"6/24-8/23",41224102,"孫O涵","女","動機系","日間部"]
[11106,1,"8/18-8/23","113新生","林O姁 ","女","企管系","日間部"]
[11106,2,"8/18-8/23","113新生","洪O菡","女","企管系","日間部"]
[11106,3,"8/18-8/23","113新生","莊O筑","女","資管系","日間部"]
[11106,4,"8/18-8/23",41241102,"吳O庭","女","資管系","日間部"]
[11107,1,"6/24-8/23",41245120,"郭O妤","女","財金系","日間部"]
[11107,2,"6/24-8/23",41023108,"柯O心","女","設計系","日間部"]
[11107,3,"6/24-8/23",41236101,"吳O和","女","臥虎","日間部"]
[11107,4,"6/24-8/23",41047115,"張O婷","女","生科系","日間部"]
[11108,1,"6/24-6/30",41246215,"洪O岑","女","企管系","日間部"]
[11108,2,"6/24-6/30",41239204,"田O婕","女","工管系","日間部"]
[11108,3,"6/24-6/30",41171101,"李O燕","女","機電輔系","日間部"]
[11108,4,"6/24-6/30",41246214,"林O萱","女","企管系","日間部"]
[11109,1,"6/24-6/30",41230103,"林O玲","女","飛航電組","日間部"]
[11109,2,"6/24-6/30",40947114,"許O晴","女","生科系","日間部"]
[11109,3,"6/24-6/30",40947113,"莊O棋","女","生科系","日間部"]
[11109,4,"6/24-6/30",41248122,"程O筑","女","多媒體系","日間部"]
[11110,1,"6/24-8/23",41246202,"古O慈","女","企管系","日間部"]
[11110,2,"6/24-8/23",41140104,"賴O婷","女","電子系","日間部"]
[11110,3,"6/24-8/23",40947105,"沈O紋","女","生科系","日間部"]
[11110,4,"6/24-8/23",41242111,"吳O歆","女","應外系","日間部"]
[11111,1,"6/24-8/23",41130202,"陳O妤","女","飛航電組","日間部"]
[11111,2,"6/24-8/23",41148425,"鄭O萱","女","多媒體系","進修推廣部"]
[11111,3,"6/24-8/23",41148404,"尤O琳","女","多媒體系","進修推廣部"]
[11111,4,"6/24-8/23",41271208,"顏O涵","女","機電輔系","日間部"]
[11115,1,"6/24-6/30",41250105,"林O怡","女","休憩系","日間部"]
[11115,2,"6/24-8/23",41250110,"陳O瑛","女","休憩系","日間部"]
[11115,3,"6/24-6/30",41148104,"吳O蓉","女","多媒體系","日間部"]
[11115,4,"6/24-6/30",41041210,"游O蓁","女","資管系技優專班","日間部"]
[11116,1,"6/24-6/30",41246130,"劉O柔","女","企管系","日間部"]
[11116,2,"8/12-8/23",41239117,"陳O瑄","女","工管系","日間部"]
[11116,3,"6/24-6/28",41142102,"王O晨","女","應外系","日間部"]
[11117,1,"6/24-8/23",41048110,"梁O琳","女","多媒體系","日間部"]
[11117,2,"6/24-8/23",41048123,"劉O妏","女","多媒體系","日間部"]
[11117,3,"6/24-8/23",40942236,"羅O詩","女","應外系","日間部"]
[11117,4,"6/24-6/30",11168117,"蔡O菁","女","多媒碩士","日間部"]
[11118,1,"6/24-8/23",41148102,"吳O嬑","女","多媒體系","日間部"]
[11118,2,"6/24-8/23",41148114,"邱O妮","女","多媒體系","日間部"]
[11118,3,"6/24-7/14",41225304,"陳O云","女","電機系","日間部"]
[11118,4,"6/24-6/30",41247126,"蔡O安","女","生科系","日間部"]
[11201,1,"6/30-8/3",40948422,"林O穎","女","多媒體系","進修推廣部"]
[11201,2,"6/24-8/23",41145411,"徐O甄","女","財金系","進修推廣部"]
[11201,3,"6/24-8/23",41047302,"柯O伶","女","生科系","日間部"]
[11201,4,"6/24-8/23",41245132,"蔡O臻","女","財金系","日間部"]
[11202,1,"6/24-8/23",41245110,"林O均","女","財金系","日間部"]
[11202,2,"6/24-8/23",41030202,"黃O安","女","飛航電組","日間部"]
[11202,3,"6/24-8/23",41030203,"廖O瑄","女","飛航電組","日間部"]
[11202,4,"6/24-8/23",41239115,"張O齡","女","工管系","日間部"]
[11203,1,"6/24-8/23",11279117,"許O翎","女","工管碩士","日間部"]
[11203,2,"6/24-8/23","D1277103","陳O玉信","女","博士","日間"]
[11203,3,"6/24-7/28",11180116,"吳O韋","女","企管系","日間部"]
[11203,4,"6/24-8/23",11278137,"阮O紅","女","航電碩士","日間部"]
[11205,1,"6/24-8/23",41025102,"陳O辰","女","電機系","日間部"]
[11205,2,"6/24-8/23",41025101,"王O芬","女","電機系","日間部"]
[11205,3,"6/24-8/23",41245118,"張O瑄","女","財金系","日間部"]
[11214,1,"6/24-8/23",41146107,"李O璇","女","企管系","日間部"]
[11214,2,"6/24-8/23",41046221,"蔡O璇","女","企管系","日間部"]
[11214,3,"6/24-8/23",41145128,"蔡O燕","女","應外系","日間部"]
[11301,1,"6/24-8/23",41132105,"陳O梅","女","材料系","日間部"]
[11301,2,"6/24-8/23",41147121,"楊O蓁","女","生科系","日間部"]
[11301,3,"6/24-8/23",41147101,"吳O融","女","生科系","日間部"]
[11401,1,"6/24-8/23",41241201,"力O婷","女","資管系","日間部"]
[11401,2,"6/24-8/23",41241205,"陳O蒨","女","財金系","日間部"]

{"sheet":"男","index":1,"n_rows":232,"n_cols":8,"rows_kept":232,"merged":[[0,0,0,7]]}
["國立虎尾科技大學113學年度暑假住宿床位公告"]
["新寢室","床位","住宿-起迄日","學號","姓名","性別","科系","日夜間部"]
[41103,2,"6/24-8/23",40928157,"林O勳","男","車輛系","日間部"]
[41106,1,"6/24-8/23",41145117,"張O綾","女","休憩系","日間部"]
[41201,1,"6/24-6/30",41224140,"黃O豪","男","動機系","日間部"]
[41201,2,"6/24-6/30",41224143,"詹O崴","男","動機系","日間部"]
[41201,3,"6/24-6/30",41224146,"潘O甫","男","動機系","日間部"]
[41201,4,"6/24-6/30",41224151,"鍾O誠","男","動機系","日間部"]
[41202,1,"6/24-7/7",41143116,"沈O碩","男","資工系","日間部"]
[41202,2,"6/24-7/5",41230152,"蘇O翼","男","飛航電組","日間部"]
[41202,3,"6/24-7/13",41143110,"何O鋒","男","資工系","日間部"]
[41202,4,"6/24-7/11",51133111,"林O崴","男","精密科","日間部"]
[41203,1,"6/24-6/30",21214114,"張O辰","男","電子科","日間部"]
[41203,2,"6/24-6/30",41223903,"吳O辰","男","設計系","進修推廣部"]
[41203,3,"6/24-6/30",41231217,"林O哲","男","飛機械組","日間部"]
[41203,4,"6/24-6/30",41125226,"陳O洋","男","電機系","日間部"]
[41204,1,"6/24-6/30",41228104,"王O鋐","男","車輛系","日間部"]
[41204,2,"6/24-6/30",41228105,"王O澤","男","車輛系","日間部"]
[41204,3,"6/24-6/30",41228106,"朱O聖","男","車輛系","日間部"]
[41204,4,"6/24-6/30",41227139,"黃O堃","男","自動化系","日間部"]
[41205,1,"6/24-6/30",41225119,"胡O德","男","電機系","日間部"]
[41205,2,"6/24-6/29",41230127,"張O荏","男","飛航電組","日間部"]
[41205,3,"6/24-6/30",41223140,"黃O韋","男","設計系","日間部"]
[41205,4,"6/24-6/30",41223143,"董O亨","男","設計系","日間部"]
[41206,1,"6/24-6/30",41223111,"巴O楓","男","設計系","日間部"]
[41206,2,"6/24-6/30",41230238,"游O端","男","航電","日間部"]
[41206,3,"6/24-6/30",21214135,"劉O亞","男","電子科","日間部"]
[41206,4,"6/24-6/29",41223234,"陳O廷","男","設計系","日間部"]
[41207,1,"6/24-6/29",41223226,"林O燁","男","設計系","日間部"]
[41207,2,"6/24-6/30",41231132,"陳O瑞","男","飛機械組","日間部"]
[41207,3,"6/24-6/30",41226215,"林O廷","男","光電系","日間部"]
[41207,4,"6/24-6/30",41226241,"楊O驊","男","光電系","日間部"]
[41201,1,"7/14-8/23",41171256,"蘇O榮","男","機電輔系","日間部"]
[41201,2,"7/14-8/23",41171243,"詹O驊","男","機電輔系","日間部"]
[41201,3,"7/17-8/20",41031112,"吳O霖","男","飛機械組","日間部"]
[41201,4,"7/15-8/23",41045147,"張O揚","男","財金系","日間部"]
[41202,1,"7/15-8/23",41028236,"廖O慶","男","車輛系","日間部"]
[41202,2,"7/15-8/23",41028444,"簡O恩","男","車輛系","進修推廣部"]
[41202,3,"7/15-8/23",50933115,"謝O庭","男","精密科","日間部"]
[41202,4,"7/14-8/23",41171235,"陳O豪","男","機電輔系","日間部"]
[41203,1,"7/15-8/23",41130216,"林O誼","男","飛航電組","日間部"]
[41203,2,"7/8-8/23",41028417,"鄭O翰","男","車輛系","進修推廣部"]
[41203,3,"7/6-8/23",41171160,"張O遠","男","機電輔系","日間部"]
[41203,4,"7/14-8/23",21214120,"陳O豐","男","電子科","日間部"]
[41204,1,"7/15-8/23",21214128,"黃O晨","男","電子科","日間部"]
[41204,2,"7/13-8/23",21214132,"葉O銘","男","電子科","日間部"]
[41204,3,"7/14-8/23",41223252,"蘇O文","男","設計系","日間部"]
[41204,4,"7/14-8/23",41123247,"蔡O翰","男","設計系","日間部"]
[41205,1,"7/14-8/23",41171251,"謝O名","男","機電輔系","日間部"]
[41205,2,"7/14-8/23",40927233,"彭O齊","男","自動化系","日間部"]
[41205,3,"7/15-8/23",41224128,"曹O壬","男","動機系","日間部"]
[41205,4,"7/15-8/23",40930106,"王O惟","男","飛航電組","日間部"]
[41206,1,"7/14-8/24",41232132,"許O棋","男","材料系","日間部"]
[41206,2,"7/15-8/23",41130136,"陳O頴","男","飛航電組","日間部"]
[41206,3,"7/15-8/23",41130153,"魏O佑","男","飛航電組","日間部"]
[41206,4,"7/14-8/23",51233125,"張O閎","男","精密科","日間部"]
[41207,1,"7/15-8/22",41028202,"郭O仁",{"$f":"IFERROR(VLOOKUP($D57,'[1]暑住E-care申請資料-ALL'!$A:$I,4,0),\" \")","v":"男"},{"$f":"IFERROR(VLOOKUP($D57,'[1]暑住E-care申請資料-ALL'!$A:$I,3,0),\" \")","v":"車輛系"},{"$f":"IFERROR(VLOOKUP($D57,'[1]暑住E-care申請資料-ALL'!$A:$I,9,0),\" \")","v":"日間部"}]
[41207,2,"7/10-8/23",41071450,"粘O鈞","男","車輛系","進修推廣部"]
[41207,3,"7/15-7/28",41032255,"鐘O銘","男","材料系","日間部"]
[41207,4,"7/17-8/21",41231207,"朱O德","男","飛機械組","日間部"]
[41208,1,"6/24-6/30",41230135,"陳O義","男","飛航電組","日間部"]
[41208,2,"6/24-6/29",11180118,"丁O勝","男","企管系","日間部"]
[41208,3,"6/24-7/14",41230251,"蘇O方","男","飛航電組","日間部"]
[41208,4,"6/24-7/14",51133115,"許O軒","男","精密科","日間部"]
[41209,1,"6/24-7/12",51133107,"王O淇","男","精密科","日間部"]
[41209,2,"6/28-7/11",51133110,"詹O霖","男","精密科","日間部"]
[41209,3,"6/28-7/11",51133113,"林O夫","男","精密科","日間部"]
[41209,4,"7/1-7/12",51133125,"林O宇","男","精密科","日間部"]
[41210,1,"6/24-7/7",41024126,"周O轅","男","動機系","日間部"]
[41210,2,"6/24-7/6",41230250,"魏O軒","男","飛航電組","日間部"]
[41210,3,"6/24-7/6",41230247,"賴O通","男","飛航電組","日間部"]
[41210,4,"6/24-7/7",41230252,"蘇O濬","男","飛航電組","日間部"]
[41211,1,"6/24-8/23","113新生","陳O翰","男","車輛系","日間部"]
[41211,2,"6/24-8/23","113新生","沈O均","男","工管系","日間部"]
[41211,3,"6/24-8/23","113新生","曾O翔","男","飛機工程系","日間部"]
[41211,4,"6/24-8/23","113新生","張O貿","男","多媒體系","夜間部"]
[41212,1,"6/24-8/23","113新生","陳O傑","男","生科系","日間部"]
[41212,2,"6/24-8/23","113新生","花O閔","男","車輛系","日間部"]
[41212,3,"6/24-8/23","113新生","葉O森","男","休憩系","日間部"]
[41213,1,"6/24-7/7",41223926,"劉O紘","男","設計系","進修推廣部"]
[41213,2,"6/24-7/21",41226224,"張O齡","男","光電系","日間部"]
[41213,3,"6/24-8/6",41226126,"莊O豪","男","光電系","日間部"]
[41213,4,"6/24-8/11",41123009,"蕭O誠","男","設計系","進修推廣部"]
[41214,1,"6/30-8/3",41171240,"黃O翔","男","機電輔系","日間部"]
[41214,2,"6/30-8/3",41171213,"李O廷","男","機電輔系","日間部"]
[41214,3,"6/30-8/3",41171254,"羅O翔","男","機電輔系","日間部"]
[41214,4,"6/30-8/2",41171227,"張O庸","男","機電輔系","日間部"]
[41215,1,"6/30-8/2",41171223,"胡O嘉","男","機電輔系","日間部"]
[41215,2,"6/24-8/23",41250129,"楊O理","男","休憩系","日間部"]
[41215,3,"6/24-8/23",41140138,"黃O鋒","男","電子系","日間部"]
[41215,4,"6/24-8/23",41123312,"林O翔","男","設計系","日間部"]
[41216,1,"6/24-8/23",41140134,"曾O豐","男","電子系","日間部"]
[41216,2,"6/24-8/23",41224141,"楊O棠","男","動機系","日間部"]
[41216,3,"6/30-8/23",40932251,"羅O軒","男","材料系","日間部"]
[41216,4,"6/24-8/23",40945134,"魯O傑","男","財金系","日間部"]
[41217,1,"6/24-8/23",41025124,"杜O豪","男","電機系","日間部"]
[41217,2,"6/24-8/23",41141114,"王O雄","男","資管系","日間部"]
[41217,3,"6/24-8/23",41032125,"宋O燁","男","材料系","日間部"]
[41217,4,"6/24-8/23",41025121,"李O橙","男","電機系","日間部"]
[41218,1,"6/24-8/23",41125234,"傅O庭","男","電機系","日間部"]
[41218,2,"6/24-8/23",41123142,"廖O祥","男","設計系","日間部"]
[41218,3,"6/24-8/23",41231151,"賴O文","男","飛機械組","日間部"]
[41218,4,"6/24-8/23",11278111,"鍾O祐","男","碩航電","日間部"]
[41219,1,"6/24-8/23",41040116,"林O荏","男","電子系","日間部"]
[41219,2,"6/24-8/23",41040118,"林O宥","男","電子系","日間部"]
[41219,3,"6/24-8/23",41040142,"楊O翔","男","電子系","日間部"]
[41220,1,"6/24-8/23",41141224,"翁O駿","男","資管系","日間部"]
[41220,2,"6/24-8/23",41128226,"徐O陽","男","車輛系","日間部"]
[41220,3,"6/24-8/23",41127249,"韓O宸","男","自動化系","日間部"]
[41221,1,"6/24-8/23",41231109,"吳O翰","男","飛機械組","日間部"]
[41221,2,"6/24-8/23",41231221,"徐O諳","男","飛機械組","日間部"]
[41221,3,"6/24-8/23",41231252,"簡O鈞","男","飛機械組","日間部"]
[41222,1,"6/24-8/23",41027204,"王O嘉","男","自動化系","日間部"]
[41222,2,"6/24-8/23",41040115,"林O","男","電子系","日間部"]
[41222,3,"6/24-8/23",40926226,"黃O達","男","光電系","日間部"]
[41223,1,"6/24-8/23",41145142,"張O源","男","財金系","日間部"]
[41223,2,"6/24-8/23",40971208,"陳O禎","男","機電輔系","日間部"]
[41223,3,"6/24-8/23",40926225,"黃O榛","男","光電系","日間部"]
[41224,1,"6/24-8/23",41223223,"林O程","男","設計系","日間部"]
[41224,2,"6/24-8/23",41230216,"林O杰","男","飛航電組","日間部"]
[41224,3,"6/24-8/23",41231138,"游O瑞","男","飛機械組","日間部"]
[41224,4,"6/24-8/23",41231154,"籃O源","男","飛機械組","日間部"]
[41227,1,"6/24-8/23",41025152,"張O羽","男","電機系","日間部"]
[41227,2,"6/24-8/23",41225128,"陳O龍","男","電機系","日間部"]
[41227,3,"6/24-8/23",41150119,"王O政","男","休憩系","日間部"]
[41227,4,"6/24-8/23",41043251,"顏O福","男","資工系","日間部"]
[41228,1,"6/24-8/23",11220148,"張O權","男","機輔碩士","日間部"]
[41228,2,"6/24-8/23",41136131,"羅O元","男","設計系","日間部"]
[41228,3,"6/24-8/23",41126219,"施O云","男","光電系","日間部"]
[41228,4,"6/24-8/23",41236121,"曾O翔","男","臥虎","日間部"]
[41229,1,"6/24-8/23",41226603,"黃O齊","男","光電系","進修推廣部"]
[41229,2,"7/29-8/23",40971421,"陳O友","男","車輛系","進修推廣部"]
[41229,3,"6/24-8/17",41225607,"葉O宏","男","電機系","進修推廣部"]
[41229,4,"6/24-8/23",41047131,"林O廷","男","生科系","日間部"]
[41230,1,"6/24-8/23",41047120,"王O翔","男","生科系","日間部"]
[41230,2,"6/24-8/23",41130137,"陳O睿","男","飛航電組","日間部"]
[41230,3,"6/24-8/23",41028257,"羅O韋","男","車輛系","日間部"]
[41230,4,"6/24-8/23",41023125,"李O淵","男","設計系","日間部"]
[41231,1,"6/24-8/4",31240111,"余O澂","男","電子系","日間部"]
[41231,2,"6/24-8/4",41231124,"張O凱","男","飛機械組","日間部"]
[41231,3,"6/24-8/4",31248143,"蕭O雲",{"$f":"IFERROR(VLOOKUP($D141,'[2]暑住E-care申請資料-ALL'!$A:$I,4,0),\" \")","v":"男"},{"$f":"IFERROR(VLOOKUP($D141,'[2]暑住E-care申請資料-ALL'!$A:$I,3,0),\" \")","v":"多媒體系"},{"$f":"IFERROR(VLOOKUP($D141,'[2]暑住E-care申請資料-ALL'!$A:$I,9,0),\" \")","v":"日間部"}]
[41231,4,"6/24-8/4",31248102,"蔡O龍",{"$f":"IFERROR(VLOOKUP($D142,'[2]暑住E-care申請資料-ALL'!$A:$I,4,0),\" \")","v":"男"},{"$f":"IFERROR(VLOOKUP($D142,'[2]暑住E-care申請資料-ALL'!$A:$I,3,0),\" \")","v":"多媒體系"},{"$f":"IFERROR(VLOOKUP($D142,'[2]暑住E-care申請資料-ALL'!$A:$I,9,0),\" \")","v":"日間部"}]
[41232,1,"6/28-7/25",41140142,"劉O禎","男","電子系","日間部"]
[41232,2,"6/24-7/14",11261134,"杜O海龍","男","資管系","日間部"]
[41232,3,"6/24-7/10",51133104,"莊O詠","男","精密科","日間部"]
[41232,4,"6/24-8/23",41248404,"周O定","男","多媒體系","進修推廣部"]
[41233,1,"7/14-8/16",51133128,"劉O懿","男","精密科","日間部"]
[41233,2,"6/24-8/23",40945132,"林O興","男","財金系","日間部"]
[41233,3,"6/24-8/14",41130108,"巫O軒","男","飛航電組","日間部"]
[41233,4,"6/24-7/14",51133116,"謝O勛","男","精密科","日間部"]
[41234,1,"6/24-7/21",41230233,"陳O崴","男","飛航電組","日間部"]
[41234,2,"6/24-8/23",41228444,"詹O宇","男","車輛系","日間部"]
[41234,3,"7/1-7/14",51133127,"洪O曜","男","精密科","日間部"]
[41234,4,"6/24-8/23",41130139,"曾O瑋","男","飛航電組","日間部"]
[41235,1,"6/24-8/23",11273111,"張O銓","男","設計碩士","日間部"]
[41235,2,"6/24-8/23",41030121,"李O恩","男","飛航電組","日間部"]
[41235,3,"6/24-8/23",41030118,"吳O霆","男","飛航電組","日間部"]
[41235,4,"6/24-8/23",41225318,"賴O臻","男","電機系","日間部"]
[41236,1,"6/24-8/23",31125146,"林O瑞","男","電機系","日間部"]
[41236,2,"6/24-8/23",41243100,"劉O行","男","資工系","日間部"]
[41236,3,"6/24-8/23",41032133,"沈O晏","男","材料系","日間部"]
[41236,4,"6/24-8/23",41036112,"李O煌","男","車輛系","日間部"]
[41237,1,"6/24-8/23",40971153,"許O恩","男","機電輔系","日間部"]
[41237,2,"6/24-8/23",21214107,"林O恩","男","電子科","日間部"]
[41237,3,"6/24-8/23",41271133,"許O富","男","機電輔系","日間部"]
[41237,4,"7/14-8/23",41024209,"陳O勳","男","動機系","日間部"]
[41238,1,"6/24-8/23",41035130,"黃O學","男","農科系","日間部"]
[41238,2,"6/24-8/23",41047226,"黃O喆","男","生科系","日間部"]
[41238,3,"6/30-8/11",41223219,"李O壕","男","設計系","日間部"]
[41238,4,"6/24-8/23",40928156,"任O軒","男","休憩系","日間部"]
[41239,1,"6/24-8/23",41141117,"何O宸","男","資管系","日間部"]
[41239,2,"6/24-8/23",41227309,"王O元","男","自動化系","日間部"]
[41239,3,"6/24-8/23",41248141,"何O鵬","男","多媒體系","日間部"]
[41239,4,"6/24-8/23",40948163,"龔O桉","男","多媒體系","日間部"]
[41240,1,"6/24-8/23",41248150,"馮O彬","男","多媒體系","日間部"]
[41240,2,"6/24-8/23",41048137,"李O陽","男","多媒體系","日間部"]
[41240,3,"6/24-8/23",41148134,"王O翔","男","多媒體系","日間部"]
[41240,4,"6/24-8/23",41148148,"莊O泉","男","多媒體系","日間部"]
[41301,1,"8/20-8/23",31148105,"羅O卿","男","多媒體系","日間部"]
[41301,2,"6/24-8/23",41145143,"張O綱","男","財金系","日間部"]
[41301,3,"6/24-8/23",41248151,"黄O謙","男","多媒體系","日間部"]
[41301,4,"6/24-8/23",41031221,"黃O喆","男","飛機械組","日間部"]
[41302,1,"6/24-8/23",40843254,"林O嘉","男","資工系","日間部"]
[41302,2,"6/24-8/23",41225121,"高O華","男","電機系","日間部"]
[41302,3,"6/24-8/23",31240116,"鄭O豪","男","電子系","日間部"]
[41302,4,"6/24-8/23",41126112,"吳O勳","男","光電系","日間部"]
[41303,1,"6/24-8/23",41226130,"連O財","男","光電系","日間部"]
[41303,2,"6/24-8/23",41143118,"周O麒","男","資工系","日間部"]
[41303,3,"6/24-8/23",41036107,"葉O強","男","電子系","日間部"]
[41303,4,"6/24-8/23",41027112,"杜O叡","男","自動化系","日間部"]
[41304,1,"6/24-8/23",41236120,"曾O翰","男","臥虎","日間部"]
[41304,2,"6/24-8/23",41036115,"張O五","男","自動化系","日間部"]
[41304,3,"6/24-8/23",41136128,"蔡O禹","男","電子系","日間部"]
[41304,4,"6/24-8/21",51133129,"許O勝","男","精密科","日間部"]
[41305,1,"6/24-8/23",41136103,"吳O源","男","設計系","日間部"]
[41305,2,"6/24-8/23",41136115,"粘O維","男","電機系","日間部"]
[41305,3,"6/24-8/23",41136109,"李O東","男","電子系","日間部"]
[41305,4,"6/24-8/23",41136113,"邱O展","男","設計系","日間部"]
[41306,1,"6/24-7/14",51133119,"梁O瑋","男","精密科","日間部"]
[41306,2,"6/24-8/23",11261130,"林O明","男","資管碩士","日間部"]
[41306,3,"6/24-8/23",41043136,"俞O威","男","資工系","日間部"]
[41306,4,"6/24-8/23",41136123,"黃O驊","男","設計系","日間部"]
[41307,1,"6/24-7/24","D1281109","北O納卡","男","博士","日間部"]
[41307,4,"8/15-8/23",11180118,"丁O勝","男","企管系","日間部"]
[41308,1,"6/24-8/23",21214112,"洪O威","男","電子科","日間部"]
[41308,2,"6/24-7/17",41230107,"吳O勳","男","飛航電組","日間部"]
[41308,3,"6/24-7/14",51133132,"李O恩",{"$f":"IFERROR(VLOOKUP($D207,'[2]暑住E-care申請資料-ALL'!$A:$I,4,0),\" \")","v":"男"},{"$f":"IFERROR(VLOOKUP($D207,'[2]暑住E-care申請資料-ALL'!$A:$I,3,0),\" \")","v":"精密科"},{"$f":"IFERROR(VLOOKUP($D207,'[2]暑住E-care申請資料-ALL'!$A:$I,9,0),\" \")","v":"日間部"}]
[41308,4,"6/24-7/13",51133128,"劉O懿","男","精密科","日間部"]
[41309,1,"6/24-8/23",41030208,"張O翔",{"$f":"IFERROR(VLOOKUP($D209,'[2]暑住E-care申請資料-ALL'!$A:$I,4,0),\" \")","v":"男"},{"$f":"IFERROR(VLOOKUP($D209,'[2]暑住E-care申請資料-ALL'!$A:$I,3,0),\" \")","v":"飛航電組"},{"$f":"IFERROR(VLOOKUP($D209,'[2]暑住E-care申請資料-ALL'!$A:$I,9,0),\" \")","v":"日間部"}]
[41309,2,"6/24-8/23",21214113,"胡O勛",{"$f":"IFERROR(VLOOKUP($D210,'[2]暑住E-care申請資料-ALL'!$A:$I,4,0),\" \")","v":"男"},{"$f":"IFERROR(VLOOKUP($D210,'[2]暑住E-care申請資料-ALL'!$A:$I,3,0),\" \")","v":"電子科"},{"$f":"IFERROR(VLOOKUP($D210,'[2]暑住E-care申請資料-ALL'!$A:$I,9,0),\" \")","v":"日間部"}]
[41309,3,"6/24-8/23",41023137,"林O源",{"$f":"IFERROR(VLOOKUP($D211,'[2]暑住E-care申請資料-ALL'!$A:$I,4,0),\" \")","v":"男"},{"$f":"IFERROR(VLOOKUP($D211,'[2]暑住E-care申請資料-ALL'!$A:$I,3,0),\" \")","v":"設計系"},{"$f":"IFERROR(VLOOKUP($D211,'[2]暑住E-care申請資料-ALL'!$A:$I,9,0),\" \")","v":"日間部"}]
[41309,4,"6/24-8/23",41132219,"李O緯",{"$f":"IFERROR(VLOOKUP($D212,'[2]暑住E-care申請資料-ALL'!$A:$I,4,0),\" \")","v":"男"},{"$f":"IFERROR(VLOOKUP($D212,'[2]暑住E-care申請資料-ALL'!$A:$I,3,0),\" \")","v":"材料系"},{"$f":"IFERROR(VLOOKUP($D212,'[2]暑住E-care申請資料-ALL'!$A:$I,9,0),\" \")","v":"日間部"}]
[41310,1,"6/24-8/23",11255117,"寧O雄",{"$f":"IFERROR(VLOOKUP($D213,'[2]暑住E-care申請資料-ALL'!$A:$I,4,0),\" \")","v":"男"},{"$f":"IFERROR(VLOOKUP($D213,'[2]暑住E-care申請資料-ALL'!$A:$I,3,0),\" \")","v":"財金系"},{"$f":"IFERROR(VLOOKUP($D213,'[2]暑住E-care申請資料-ALL'!$A:$I,9,0),\" \")","v":"日間部"}]
[41310,4,"6/24-8/23",40971132,"林O豪",{"$f":"IFERROR(VLOOKUP($D214,'[2]暑住E-care申請資料-ALL'!$A:$I,4,0),\" \")","v":"男"},{"$f":"IFERROR(VLOOKUP($D214,'[2]暑住E-care申請資料-ALL'!$A:$I,3,0),\" \")","v":"機電輔系"},{"$f":"IFERROR(VLOOKUP($D214,'[2]暑住E-care申請資料-ALL'!$A:$I,9,0),\" \")","v":"日間部"}]
[41311,1,"7/2-7/21",41230133,"陳O瑞","男","飛航電組","日間部"]
[41311,2,"7/14-8/23",41140105,"毛O民","男","電子系","日間部"]
[41311,3,"7/14-8/23",41140114,"林O右","男","電子系","日間部"]
[41311,4,"7/14-8/23",41171110,"吳O祥","男","機電輔系","日間部"]
[41312,1,"6/24-6/30",41224134,"陳O仁","男","動機系","日間部"]
[41312,2,"6/24-6/28",41271257,"蘇O堯","男","機電輔系","日間部"]
[41312,3,"6/24-7/7",41023248,"蔡O霖","男","設計系","日間部"]
[41312,4,"6/24-8/5",41123143,"劉O湶","男","設計系","日間部"]
[41313,1,"6/24-8/23",41036110,"呂O樺","男","材料系","日間部"]
[41313,2,"6/24-8/23",41171123,"胡O赫","男","機電輔系","日間部"]
[41313,3,"6/24-8/23",11158118,"李O鋒","男","車輛碩","日間部"]
[41313,4,"6/24-8/23",51215135,"楊O棠","男","資工科","日間部"]
[41314,1,"6/24-8/23",41245153,"盧O孟","男","財金系","日間部"]
[41314,2,"6/24-7-6",41224930,"劉O晨","男","動機系","進修推廣部"]
[41314,3,"6/24-6/30",41226137,"彭O宇","男","光電系","日間部"]
[41314,4,"7/19-8/23",41071429,"洪O峻","男","機電輔系","進修推廣部"]
[41315,1,"6/24-8/23",51133114,"劉O","男","精密科","日間部"]
[41315,2,"6/24-8/23",41271111,"王O翔","男","機電輔系","日間部"]